在非GO的EEA项目跑CTS Express脚本发生Error!!! Assistant icon is not on screen +1 on EEA build问题

问题描述

 在非GO的EEA项目跑CTS Express脚本发生Error!!! Assistant icon is not on screen +1 on EEA build问题

解决方案

继续阅读“在非GO的EEA项目跑CTS Express脚本发生Error!!! Assistant icon is not on screen +1 on EEA build问题”

[CTS10R2]android.appsecurity.cts.AdoptableHostTest#testEjected

问题描述

android.hardware.camera2.cts.StillCaptureTest#testAeCompensation
Fail:
java.lang.Exception: There were 8 errors:
java.lang.Throwable(Test failed for camera 0: Exposure compensation ratio exceeds error tolerence: expected(0.250000) observed(1.000000). Normal exposure time 30001 us, sensitivity 156. Compensated exposure time 30001 us, sensitivity 156, value 4.0 is out of range [0.8, 1.2])
  java.lang.Throwable(Test failed for camera 0: Exposure compensation ratio exceeds error tolerence: expected(0.500000) observed(1.000000). Normal exposure time 30001 us, sensitivity 156. Compensated exposure time 30001 us, sensitivity 156, value 2.0 is out of range [0.8, 1.2])

继续阅读“[CTS10R2]android.appsecurity.cts.AdoptableHostTest#testEjected”

[VTSR10R2]CtsStatsdHostTestCases

问题描述

CtsStatsdHostTestCases
android.cts.statsd.atom.UidAtomTests#testDeviceCalculatedPowerBlameUid
android.cts.statsd.validation.BatteryStatsValidationTests#testPowerBlameUid
Fail:
junit.framework.AssertionFailedError: No power value for uid 10149
junit.framework.AssertionFailedError: No power value for uid 10146
junit.framework.AssertionFailedError: Statsd: No power value for uid 10151

解决方案

继续阅读“[VTSR10R2]CtsStatsdHostTestCases”

[CTS10R2]CtsMediaTestCases

问题描述

CtsMediaTestCases
android.media.cts.VideoDecoderPerfTest#testAvcOther1Perf0320x0240
android.media.cts.VideoDecoderPerfTest#testAvcOther1Perf0720x0480
android.media.cts.VideoDecoderPerfTest#testAvcOther1Perf1280x0720
android.media.cts.VideoDecoderPerfTest#testAvcOther1Perf1920x1080
Fail:
junit.framework.AssertionFailedError: Failed to get achievable frame rates for OMX.MTK.VIDEO.DECODER.AVC.l3 video/avc 320x240
junit.framework.AssertionFailedError: Failed to get achievable frame rates for OMX.MTK.VIDEO.DECODER.AVC.l3 video/avc 320x240
junit.framework.AssertionFailedError: Failed to get achievable frame rates for OMX.MTK.VIDEO.DECODER.AVC.l3 video/avc 720x480
junit.framework.AssertionFailedError: Failed to get achievable frame rates for OMX.MTK.VIDEO.DECODER.AVC.l3 video/avc 1280x720
junit.framework.AssertionFailedError: Failed to get achievable frame rates for OMX.MTK.VIDEO.DECODER.AVC.l3 video/avc 1920x1080

解决方案

继续阅读“[CTS10R2]CtsMediaTestCases”

[VTS10R2]CtsMediaTestCases-android.media.cts.AudioRecordTest#testTimestamp

问题描述

CtsMediaTestCases
CtsMediaTestCases-android.media.cts.AudioRecordTest#testTimestamp
Fail:
java.lang.AssertionError: timestamp frames should be increasing

解决方案

继续阅读“[VTS10R2]CtsMediaTestCases-android.media.cts.AudioRecordTest#testTimestamp”

[CTS10R2]android.view.cts.ASurfaceControlTest#testSurfaceTransaction_setColorAndBuffer_bufferAlpha_0_5

问题描述

CtsViewTestCases
android.view.cts.ASurfaceControlTest#testSurfaceTransaction_setColorAndBuffer_bufferAlpha_0_5
Fail:
java.lang.SecurityException: Permission Denial: startForeground from pid=20136, uid=10154 requires android.permission.INSTANT_APP_FOREGROUND_SERVICE

解决方案

继续阅读“[CTS10R2]android.view.cts.ASurfaceControlTest#testSurfaceTransaction_setColorAndBuffer_bufferAlpha_0_5”

[GTSR3]com.google.android.dialer.gts.GtsDialerDeviceTest#makeCall_verifyDialerWorking

问题描述

GtsDialerDeviceTestCases  com.google.android.dialer.gts.GtsDialerDeviceTest#makeCall_verifyDialerWorking
Fail:
java.lang.AssertionError: Error running self check - Active call audio not available.: Not true that <FAILED> is equal to <SUCCESS>

解决方案

继续阅读“[GTSR3]com.google.android.dialer.gts.GtsDialerDeviceTest#makeCall_verifyDialerWorking”

[VTS10R2]VtsHalGraphicsComposerV2_1Target

问题描述

VtsHalGraphicsComposerV2_1Target
VtsHalGraphicsComposerV2_1Target#GraphicsComposerHidlCommandTest.SET_COLOR_TRANSFORM(default)_64bit fail
VtsHalGraphicsComposerV2_1Target#GraphicsComposerHidlCommandTest.SET_COLOR_TRANSFORM(default)_32bit fail:
hardware/interfaces/graphics/composer/2.1/vts/functional/VtsHalGraphicsComposerV2_1TargetTest.cpp:681
Expected equality of these values:
0
mReader->mErrors.size()
Which is: 1

解决方案

继续阅读“[VTS10R2]VtsHalGraphicsComposerV2_1Target”

[CTS-10.0_R2]CTS测试过程中,出现多次 permissionController 停止运行

问题描述

挂测CTS过程中,出现多次 permissionController 停止运行,导致CTS无法正常挂测
02-13 11:31:46.354 10052  1622  1622 E AndroidRuntime: FATAL EXCEPTION: main
02-13 11:31:46.354 10052  1622  1622 E AndroidRuntime: Process: com.android.permissioncontroller, PID: 1622
02-13 11:31:46.354 10052  1622  1622 E AndroidRuntime: java.lang.IllegalArgumentException: Unknown package: android.tradefed.contentprovider

解决方案

继续阅读“[CTS-10.0_R2]CTS测试过程中,出现多次 permissionController 停止运行”

[VTS_10.0_R2]VtsTrebleSysProp#VtsTrebleSysProp#testVendorPropertyNamespace

问题描述

VtsTrebleSysProp
VtsTrebleSysProp#testVendorPropertyNamespace
Fail Details:
6 != 0 vendor propertes (ro.custom.build.version ro.internal.build.version ro.tcustom.build.version ro.tinno.scc ro.tinno.scc.tlc ro.tinternal.build.version) have wrong namespace

 解决方案

继续阅读“[VTS_10.0_R2]VtsTrebleSysProp#VtsTrebleSysProp#testVendorPropertyNamespace”

[VTS10.0r1]VtsKernelNetdTest#NetdSELinuxTest.CheckProperMTULabels_32bit fail

问题描述

VtsKernelNetdTest#NetdSELinuxTest.CheckProperMTULabels_32bit fail
VtsKernelNetdTest#NetdSELinuxTest.CheckProperMTULabels_64bit fail
system/netd/tests/netd_test.cpp:34
Expected equality of these values:
((1) &lt;&lt; 8 | (0))
Which is: 256
system("ls -Z /sys/class/net/*/mtu | egrep -q -v " "'^u:object_r:sysfs_net:s0 /sys/class/net/'")
Which is: 0

[CTS10.0_r2]CtsSecureElementAccessControlTestCases

问题描述

CtsSecureElementAccessControlTestCases1[instant]
android.omapi.accesscontrol1.cts.AccessControlTest#testAuthorizedAPDUAID40
android.omapi.accesscontrol1.cts.AccessControlTest#testAuthorizedAPDUAID41
android.omapi.accesscontrol1.cts.AccessControlTest#testUnauthorizedAID
android.omapi.accesscontrol1.cts.AccessControlTest#testUnauthorisedAPDUAID40
android.omapi.accesscontrol1.cts.AccessControlTest#testUnauthorisedAPDUAID41
android.omapi.accesscontrol1.cts.AccessControlTest#testAuthorizedAID
fail
java.lang.AssertionError

[GTSR3]com.google.android.storage.gts.StorageTest#testSystemStorageUsage

问题描述

GtsStorageTestCases
com.google.android.storage.gts.StorageTest#testSystemStorageUsage
Fail:
java.lang.AssertionError: Not enough space for user available: 11924373504 < 12000000000 (total: 16000000000)

[VTS 9.0_R11]CtsNativeHardwareTestCases三项fail

问题描述

android.hardware.nativehardware.cts.AHardwareBufferNativeTests#SingleLayer_DepthTest_DepthAffectsDrawAcrossContexts_0
android.hardware.nativehardware.cts.AHardwareBufferNativeTests#SingleLayer_StencilTest_StencilAffectsDrawAcrossContexts_GL_DEPTH24_STENCIL8
android.hardware.nativehardware.cts.AHardwareBufferNativeTests#SingleLayer_StencilTest_StencilAffectsDrawAcrossContexts_GL_STENCIL_INDEX8
Fail:
java.lang.AssertionError: cts/tests/tests/nativehardware/jni/AHardwareBufferGLTest.cpp:295