GTS6.0 R1常见fail

1 GtsPlacementTestCases

–com.google.android.placement.gts.CoreGmsAppsPrivappPermissionsTest

#testCoreGmsAppsPermissionsWhitelisted 

android.content.pm.PackageManager$NameNotFoundException: com.google.android.apps.docs
at android.app.ApplicationPackageManager.getPackageInfoAsUser(ApplicationPackageManager.java:179)
at android.app.ApplicationPackageManager.getPackageInfo(ApplicationPackageManager.java:150)

解决方案:

豁免信息

https://partnerissuetracker.corp.google.com/u/1/issues/111093792

BUGID: 110236772

to be fixed in GTS 6.0 R2


2 GtsMemoryHostTestCases

—com.google.android.memory.gts.MemoryHostTest

#testSystemMemoryAvailabilityPostBoot

in host log
AndroidRuntime: Suppressed: java.io.IOException: Failed to open dex files from /data/app/com.google.android.memory.gts-GNjFhEDh8IVwW2uGeqtNtQ==/base.apk because: Unrecognized version number in /data/app/com.google.android.memory.gts-GNjFhEDh8IVwW2uGeqtNtQ==/base.apk: 0 3 9.

解决方案:

6.0 R1 <= 1g 项目是可以waive的, 6.0 R2解掉

豁免信息

https://partnerissuetracker.corp.google.com/issues/111530386

BUGID: 111453478


3 GtsBackupHostTestCases.

com.google.android.gts.backup.SettingsProviderBackupHostTest#testSoftApE2EBR

java.lang.AssertionError: on-device tests failed:
com.google.android.gts.backup.testscontainerapp.SettingsProviderBackupTest#testSoftApE2EBR:
java.lang.AssertionError: Backup was unsuccessful, error code: -2001

解决方案:

豁免信息

BUGID: 79420733


4 GtsPlacementTestCases

com.google.android.placement.gts.UiPlacementTest#testGoSearchWidget

java.lang.AssertionError: Google Go Search Widget not found on default home screen.

解决方案:

豁免信息

BUGID:  b/112177790

微信扫码打赏

作者: RESSRC

个人资源站

发表评论

电子邮件地址不会被公开。 必填项已用*标注

此站点使用Akismet来减少垃圾评论。了解我们如何处理您的评论数据